id,form_name,user_name,user_email,user_phone,user_text,user_company,status,followDate,site,callAction,clientType,informhr,deleted,createdat
1,Data_Collection,,support@techxpress.com,(931) 455-1006,https://www.amazon.co.uk/sp?_encoding=UTF8&asin=&isAmazonFulfilled=&isCBA=&marketplaceID=A1F83G8C2ARO7P&orderID=&seller=A3GUGFLHFZU4AF&tab=&vasStoreID=,Techspres LLC,,01/01/2018,AMAZON,0,,0,0,01/01/2018 01:01
2,Data_Collection,,sales@allcam.co.uk,(121) 440-8900,https://www.amazon.co.uk/sp?_encoding=UTF8&asin=B0000C73CQ&isAmazonFulfilled=0&isCBA=&marketplaceID=A1F83G8C2ARO7P&orderID=&seller=A2LXHTRCF7AENL&tab=&vasStoreID=,Allcam Mobile Products Ltd.,,02/01/2018,AMAZON,0,,0,0,02/01/2018 01:01
3,Data_Collection,,audio123@audio123.co.uk,(121) 291-2636,https://www.amazon.co.uk/sp?_encoding=UTF8&asin=B007UZEBRG&isAmazonFulfilled=0&isCBA=&marketplaceID=A1F83G8C2ARO7P&orderID=&seller=A1L2XLZL3MF9Z0&tab=&vasStoreID=,AUDIO123 LIMITED,,03/01/2018,AMAZON,0,,0,0,03/01/2018 01:01
4,Data_Collection,,info@chemistextra.co.uk,(122) 726-2916,https://www.amazon.co.uk/sp?_encoding=UTF8&asin=B0055C49NM&isAmazonFulfilled=0&isCBA=&marketplaceID=A1F83G8C2ARO7P&orderID=&seller=A6PNYATO1EPPV&tab=&vasStoreID=,BERKELEY PHARMA LTD,,04/01/2018,AMAZON,0,,0,0,04/01/2018 01:01
5,Data_Collection,,customer.service@cramptonandmoore.co.uk,(122) 635-0754,https://www.amazon.co.uk/sp?_encoding=UTF8&asin=B075GVBPXY&isAmazonFulfilled=1&isCBA=&marketplaceID=A1F83G8C2ARO7P&orderID=&seller=A23TK9ZAIO7XF&tab=&vasStoreID=,Crampton and Moore (Television) LTD,,05/01/2018,AMAZON,0,,0,0,05/01/2018 01:01
6,Data_Collection,,customer.services@GroomU.co.uk,(121) 327-2721,https://www.amazon.co.uk/sp?_encoding=UTF8&asin=B00CYOVJAA&isAmazonFulfilled=1&isCBA=&marketplaceID=A1F83G8C2ARO7P&orderID=&seller=A14ZMJR6D1C1AR&tab=&vasStoreID=,GroomU Limited,,06/01/2018,AMAZON,0,,0,0,06/01/2018 01:01
7,Data_Collection,,,(121) 439-1610,https://www.amazon.co.uk/sp?_encoding=UTF8&asin=B01KYQRFQG&isAmazonFulfilled=0&isCBA=&marketplaceID=A1F83G8C2ARO7P&orderID=&seller=A3MSFXHICFPRM2&tab=&vasStoreID=,MixMatchMakeup Ltd,,07/01/2018,AMAZON,0,,0,0,07/01/2018 01:01
8,Data_Collection,,,(126) 852-0050,https://www.amazon.co.uk/sp?_encoding=UTF8&asin=B00C1WQ62G&isAmazonFulfilled=1&isCBA=&marketplaceID=A1F83G8C2ARO7P&orderID=&seller=A2FWW8IJGLHSVP&tab=&vasStoreID=,Mr Cosmetics Ltd,,08/01/2018,AMAZON,0,,0,0,08/01/2018 01:01
9,Data_Collection,,email@pred8tor.com,(121) 227-5330,https://www.amazon.co.uk/sp?_encoding=UTF8&asin=B00NZ99FPY&isAmazonFulfilled=0&isCBA=&marketplaceID=A1F83G8C2ARO7P&orderID=&seller=A2EZOAINF38RMK&tab=&vasStoreID=,Pred8tor Services Ltd,,09/01/2018,AMAZON,0,,0,0,09/01/2018 01:01
10,Data_Collection,,info@primrose.co.uk,(122) 557-1918,https://www.amazon.co.uk/sp?_encoding=UTF8&asin=B009RRHMPI&isAmazonFulfilled=0&isCBA=&marketplaceID=A1F83G8C2ARO7P&orderID=&seller=A218PXR5F3LI1C&tab=&vasStoreID=,PRIMROSE LEATHER LTD,,10/01/2018,AMAZON,0,,0,0,10/01/2018 01:01
11,Data_Collection,,sales@123healthshop.co.uk,(177) 228-6112,https://www.amazon.co.uk/sp?_encoding=UTF8&asin=B00IA453T6&isAmazonFulfilled=1&isCBA=&marketplaceID=A1F83G8C2ARO7P&orderID=&seller=A2VPOE2RMEON6U&tab=&vasStoreID=,123 Direct Ltd,,11/01/2018,AMAZON,0,,0,0,11/01/2018 01:01
12,Data_Collection,,accessoryatticuk@gmail.com.,(790) 433-9940,https://www.amazon.co.uk/sp?_encoding=UTF8&asin=B01HTNUK8W&isAmazonFulfilled=0&isCBA=&marketplaceID=A1F83G8C2ARO7P&orderID=&seller=AJJ987TRZ938D&tab=&vasStoreID=,Accessories Attic Limited,,12/01/2018,AMAZON,0,,0,0,12/01/2018 01:01
13,Data_Collection,,email@loveafrocosmetics.com,(44208) 520-7217,https://www.amazon.co.uk/sp?_encoding=UTF8&asin=B00BMMSRBY&isAmazonFulfilled=0&isCBA=&marketplaceID=A1F83G8C2ARO7P&orderID=&seller=A25Q0KPRZAWROM&tab=&vasStoreID=,AFRO COSMETICS 4U LIMITED,,13/01/2018,AMAZON,0,,0,0,13/01/2018 01:01
14,Data_Collection,,info@prescriptioncounter.co.uk,(203) 659-3149,https://www.amazon.co.uk/sp?_encoding=UTF8&asin=B0033AGBVQ&isAmazonFulfilled=0&isCBA=&marketplaceID=A1F83G8C2ARO7P&orderID=&seller=A238NU8TQOW0GJ&tab=&vasStoreID=,AJPHARM ltd,,14/01/2018,AMAZON,0,,0,0,14/01/2018 01:01
15,Data_Collection,,info@albion.co.uk,(207) 212-9090,https://www.amazon.co.uk/sp?_encoding=UTF8&asin=B071X4YWBD&isAmazonFulfilled=0&isCBA=&marketplaceID=A1F83G8C2ARO7P&orderID=&seller=ANXJ99CKX2OQV&tab=&vasStoreID=,Albion Computers PLC,,15/01/2018,AMAZON,0,,0,0,15/01/2018 01:01
16,Data_Collection,,alan@allensrx.com,(208) 989-3353,https://www.amazon.co.uk/sp?_encoding=UTF8&asin=B0022YWF5K&isAmazonFulfilled=0&isCBA=&marketplaceID=A1F83G8C2ARO7P&orderID=&seller=ATCXTXG2T66Q&tab=&vasStoreID=,Allens pharmacy,,16/01/2018,AMAZON,0,,0,0,16/01/2018 01:01
17,Data_Collection,,sales@amazinghealth.co.uk,,https://www.amazon.co.uk/sp?_encoding=UTF8&asin=B008CCPMBU&isAmazonFulfilled=0&isCBA=&marketplaceID=A1F83G8C2ARO7P&orderID=&seller=A7HQFMNABYV0X&tab=&vasStoreID=,Amazing Health,,17/01/2018,AMAZON,0,,0,0,17/01/2018 01:01
18,Data_Collection,,,(44161) 871-7480,https://www.amazon.co.uk/sp?_encoding=UTF8&asin=B015YPMC4M&isAmazonFulfilled=0&isCBA=&marketplaceID=A1F83G8C2ARO7P&orderID=&seller=A3K5OREOBMX5XU&tab=&vasStoreID=,Arfa Enterprises Ltd,,18/01/2018,AMAZON,0,,0,0,18/01/2018 01:01
19,Data_Collection,,,(44783) 291-7429,https://www.amazon.co.uk/sp?_encoding=UTF8&asin=B00H14ZQQG&isAmazonFulfilled=0&isCBA=&marketplaceID=A1F83G8C2ARO7P&orderID=&seller=A1UV3Z2YWEY1KK&tab=&vasStoreID=,Arramt Limited,,19/01/2018,AMAZON,0,,0,0,19/01/2018 01:01
20,Data_Collection,,sales@bbew.co.uk,(203) 372-5133,https://www.amazon.co.uk/sp?_encoding=UTF8&asin=B001FFH4E4&isAmazonFulfilled=0&isCBA=&marketplaceID=A1F83G8C2ARO7P&orderID=&seller=A1QG5WYRAJPETN&tab=&vasStoreID=,B&B WHOLESALE LIMITED,,20/01/2018,AMAZON,0,,0,0,20/01/2018 01:01
21,Data_Collection,,info@tulipnailsnspa.com,(120) 228-0830,https://www.amazon.co.uk/sp?_encoding=UTF8&asin=B00B84OJ54&isAmazonFulfilled=0&isCBA=&marketplaceID=A1F83G8C2ARO7P&orderID=&seller=A3889UIKHK9VCJ&tab=&vasStoreID=,Beauty Tulips Limited,,21/01/2018,AMAZON,0,,0,0,21/01/2018 01:01
22,Data_Collection,,bparker@betterlifehealthcare.com,01772 644 288,https://www.amazon.co.uk/sp?_encoding=UTF8&asin=B0168IACBE&isAmazonFulfilled=0&isCBA=&marketplaceID=A1F83G8C2ARO7P&orderID=&seller=A3CEDI6VXF6B9J&tab=&vasStoreID=,Betterlife at LloydsPharmacy,,22/01/2018,AMAZON,0,,0,0,22/01/2018 01:01
23,Data_Collection,,,01772 644 288,https://www.amazon.co.uk/sp?_encoding=UTF8&asin=B009DZV7MI&isAmazonFulfilled=0&isCBA=&marketplaceID=A1F83G8C2ARO7P&orderID=&seller=A3CEDI6VXF6B9J&tab=&vasStoreID=,BetterlifeHealthcare Limited,,23/01/2018,AMAZON,0,,0,0,23/01/2018 01:01
24,Data_Collection,,Castle@BluestoneUk.com,(192) 389-7936,https://www.amazon.co.uk/sp?_encoding=UTF8&asin=B00NZ99FPY&isAmazonFulfilled=0&isCBA=&marketplaceID=A1F83G8C2ARO7P&orderID=&seller=ADM5BEW7E2A35&tab=&vasStoreID=,Bluestone Online Limited,,24/01/2018,AMAZON,0,,0,0,24/01/2018 01:01
25,Data_Collection,,info@bodyactivegym.co.uk,(113) 345-9344,https://www.amazon.co.uk/sp?_encoding=UTF8&asin=B00TFB0YX8&isAmazonFulfilled=0&isCBA=&marketplaceID=A1F83G8C2ARO7P&orderID=&seller=A1MXWK6H2MH2KP&tab=&vasStoreID=,Body Active (Leeds) Ltd,,25/01/2018,AMAZON,0,,0,0,25/01/2018 01:01
26,Data_Collection,,info@www.bodyreform.co.nz,(292) 115-3480,https://www.amazon.co.uk/sp?_encoding=UTF8&asin=B007NPX4LM&isAmazonFulfilled=0&isCBA=&marketplaceID=A1F83G8C2ARO7P&orderID=&seller=A4T0QM5LTE81Q&tab=&vasStoreID=,BODY REFORM LIMITED,,26/01/2018,AMAZON,0,,0,0,26/01/2018 01:01
27,Data_Collection,,,(790) 370-6496,https://www.amazon.co.uk/sp?_encoding=UTF8&asin=B074X1DG14&isAmazonFulfilled=0&isCBA=&marketplaceID=A1F83G8C2ARO7P&orderID=&seller=AVHR97F15D7QD&tab=&vasStoreID=,Budget Bargains Ltd,,27/01/2018,AMAZON,0,,0,0,27/01/2018 01:01
28,Data_Collection,,,(44742) 445-6570,https://www.amazon.co.uk/sp?_encoding=UTF8&asin=B013U0D8GY&isAmazonFulfilled=0&isCBA=&marketplaceID=A1F83G8C2ARO7P&orderID=&seller=AQVTLONP3WJIL&tab=&vasStoreID=,BUYERSBARGIN LIMITED,,28/01/2018,AMAZON,0,,0,0,28/01/2018 01:01
29,Data_Collection,,,(3495) 849-0405,https://www.amazon.co.uk/sp?_encoding=UTF8&asin=B00C1WQ62G&isAmazonFulfilled=0&isCBA=&marketplaceID=A1F83G8C2ARO7P&orderID=&seller=AYQ0NSWRNOTO4&tab=&vasStoreID=,"BUYIN COMERCIOWEB, SOCIEDAD LIMITADA",,29/01/2018,AMAZON,0,,0,0,29/01/2018 01:01
30,Data_Collection,,info@enterprisecaresupport.org.uk,(44800) 689-3803,https://www.amazon.co.uk/sp?_encoding=UTF8&asin=B0160Y4TYM&isAmazonFulfilled=0&isCBA=&marketplaceID=A1F83G8C2ARO7P&orderID=&seller=A35AVX6DVQO0LH&tab=&vasStoreID=,Care Enterprise Limited,,30/01/2018,AMAZON,0,,0,0,30/01/2018 01:01
31,Data_Collection,,,(207) 117-2868,https://www.amazon.co.uk/sp?_encoding=UTF8&asin=B0742K6M7B&isAmazonFulfilled=1&isCBA=&marketplaceID=A1F83G8C2ARO7P&orderID=&seller=A2GC75YVQEGA3Y&tab=&vasStoreID=,COAL WHITE CO LTD,,31/01/2018,AMAZON,0,,0,0,31/01/2018 01:01
32,Data_Collection,,CustomerService@Contico.com,(44744) 721-4397,https://www.amazon.co.uk/sp?_encoding=UTF8&asin=B004RF2D3Q&isAmazonFulfilled=0&isCBA=&marketplaceID=A1F83G8C2ARO7P&orderID=&seller=AXN8IF89P09KZ&tab=&vasStoreID=,continental commercial Ltd,,01/02/2018,AMAZON,0,,0,0,01/02/2018 01:01
33,Data_Collection,,info@pharma-cos.com,(44203) 695-1894,https://www.amazon.co.uk/sp?_encoding=UTF8&asin=B001EWF29M&isAmazonFulfilled=1&isCBA=&marketplaceID=A1F83G8C2ARO7P&orderID=&seller=A2N07E0JH28CRU&tab=&vasStoreID=,COSFARMA LTD,,02/02/2018,AMAZON,0,,0,0,02/02/2018 01:01
34,Data_Collection,,customercare@cosmeticsolutions.com,(44800) 756-5595,https://www.amazon.co.uk/sp?_encoding=UTF8&asin=B00104U2Z8&isAmazonFulfilled=0&isCBA=&marketplaceID=A1F83G8C2ARO7P&orderID=&seller=A1C65A1P4EY9JA&tab=&vasStoreID=,COSMETIC SOLUTIONS.COM CORP.,,03/02/2018,AMAZON,0,,0,0,03/02/2018 01:01
35,Data_Collection,,,(44778) 473-6044,https://www.amazon.co.uk/sp?_encoding=UTF8&asin=B00K2U5X6Y&isAmazonFulfilled=0&isCBA=&marketplaceID=A1F83G8C2ARO7P&orderID=&seller=A3PQHYQW6QKKSZ&tab=&vasStoreID=,COSMETICSHQ LIMITED,,04/02/2018,AMAZON,0,,0,0,04/02/2018 01:01
36,Data_Collection,,info@crowntrade.co.uk,(44795) 162-0442,https://www.amazon.co.uk/sp?_encoding=UTF8&asin=B007JK42HQ&isAmazonFulfilled=1&isCBA=&marketplaceID=A1F83G8C2ARO7P&orderID=&seller=A2FZS10PG4TLZS&tab=&vasStoreID=,Crown Trade,,05/02/2018,AMAZON,0,,0,0,05/02/2018 01:01
37,Data_Collection,,info@mypharmacysaver.com,(208) 732-5465,https://www.amazon.co.uk/sp?_encoding=UTF8&asin=B0182AN786&isAmazonFulfilled=1&isCBA=&marketplaceID=A1F83G8C2ARO7P&orderID=&seller=A10NUWIE5VL7CQ&tab=&vasStoreID=,Curamed Ltd,,06/02/2018,AMAZON,0,,0,0,06/02/2018 01:01
38,Data_Collection,,sales@dabmoo.com,(44742) 444-4234,https://www.amazon.co.uk/sp?_encoding=UTF8&asin=B01HTNUK8W&isAmazonFulfilled=0&isCBA=&marketplaceID=A1F83G8C2ARO7P&orderID=&seller=A2DY5QRFOH7PXH&tab=&vasStoreID=,Dabmoo Limited,,07/02/2018,AMAZON,0,,0,0,07/02/2018 01:01
39,Data_Collection,,,(207) 247-6435,https://www.amazon.co.uk/sp?_encoding=UTF8&asin=B001B92F9I&isAmazonFulfilled=0&isCBA=&marketplaceID=A1F83G8C2ARO7P&orderID=&seller=A3OVAKZQCWKZRS&tab=&vasStoreID=,DALLAS WEAR LIMITED,,08/02/2018,AMAZON,0,,0,0,08/02/2018 01:01
40,Data_Collection,,perfection@madfordetailing.com,(44755) 736-5818,https://www.amazon.co.uk/sp?_encoding=UTF8&asin=B01N14ISMN&isAmazonFulfilled=0&isCBA=&marketplaceID=A1F83G8C2ARO7P&orderID=&seller=A1T4FD8XG2SZDS&tab=&vasStoreID=,Detailing Supplies LTD,,09/02/2018,AMAZON,0,,0,0,09/02/2018 01:01
41,Data_Collection,,care@dtcont.com,(208) 500-4949,https://www.amazon.co.uk/sp?_encoding=UTF8&asin=B00LMDWOEO&isAmazonFulfilled=0&isCBA=&marketplaceID=A1F83G8C2ARO7P&orderID=&seller=A230Q07CL2JWPH&tab=&vasStoreID=,DIGITAL TECHNOLOGY LIMITED,,10/02/2018,AMAZON,0,,0,0,10/02/2018 01:01
42,Data_Collection,,info@directimportsuk.co.uk,(208) 599-3777,https://www.amazon.co.uk/sp?_encoding=UTF8&asin=B00LC8P7MU&isAmazonFulfilled=0&isCBA=&marketplaceID=A1F83G8C2ARO7P&orderID=&seller=A22GL14N7NM7OB&tab=&vasStoreID=,Direct Import (London) Ltd.,,11/02/2018,AMAZON,0,,0,0,11/02/2018 01:01
43,Data_Collection,,lawrence@k9frisbee.com,(170) 635-3222,https://www.amazon.co.uk/sp?_encoding=UTF8&asin=B01DY36K5I&isAmazonFulfilled=0&isCBA=&marketplaceID=A1F83G8C2ARO7P&orderID=&seller=AIHESF6Q5HQVQ&tab=&vasStoreID=,Disc-connected,,12/02/2018,AMAZON,0,,0,0,12/02/2018 01:01
44,Data_Collection,,,(787) 788-9893,https://www.amazon.co.uk/sp?_encoding=UTF8&asin=B00INPAGP8&isAmazonFulfilled=0&isCBA=&marketplaceID=A1F83G8C2ARO7P&orderID=&seller=A31ORV9OPR4EH&tab=&vasStoreID=,DISCOUNTED PRICE LTD,,13/02/2018,AMAZON,0,,0,0,13/02/2018 01:01
45,Data_Collection,,office@dreamland.co.uk,(333) 311-2114,https://www.amazon.co.uk/sp?_encoding=UTF8&asin=B005RF80ZA&isAmazonFulfilled=0&isCBA=&marketplaceID=A1F83G8C2ARO7P&orderID=&seller=A2EMHMFO63LHS7&tab=&vasStoreID=,DREAMLAND VALUE TRADING Ltd,,14/02/2018,AMAZON,0,,0,0,14/02/2018 01:01
46,Data_Collection,,sales@dentaldirect.co.uk,(845) 686-1365,https://www.amazon.co.uk/sp?_encoding=UTF8&asin=B00K2U5XFK&isAmazonFulfilled=0&isCBA=&marketplaceID=A1F83G8C2ARO7P&orderID=&seller=A1SK95XB6LRO2K&tab=&vasStoreID=,DWS Management Ltd,,15/02/2018,AMAZON,0,,0,0,15/02/2018 01:01
47,Data_Collection,,enquiries@theenglishshavingcompany.com,(114) 270-0322,https://www.amazon.co.uk/sp?_encoding=UTF8&asin=B0105WVRP4&isAmazonFulfilled=0&isCBA=&marketplaceID=A1F83G8C2ARO7P&orderID=&seller=A13KYUZ2RNWR9H&tab=&vasStoreID=,Edwin Jagger T/A The English Shaving Company,,16/02/2018,AMAZON,0,,0,0,16/02/2018 01:01
48,Data_Collection,,info@gkinteriors.co.uk,(208) 459-9900,https://www.amazon.co.uk/sp?_encoding=UTF8&asin=B0017RHFQW&isAmazonFulfilled=0&isCBA=&marketplaceID=A1F83G8C2ARO7P&orderID=&seller=A3HV9ZRRTRLPZK&tab=&vasStoreID=,Euro Delux Ltd,,17/02/2018,AMAZON,0,,0,0,17/02/2018 01:01
49,Data_Collection,,contact@ironlabsnutrition.com,(207) 097-1384,https://www.amazon.co.uk/sp?_encoding=UTF8&asin=B072QTB6S4&isAmazonFulfilled=1&isCBA=&marketplaceID=A1F83G8C2ARO7P&orderID=&seller=A1FPRKWSNAEWXB&tab=&vasStoreID=,Euro Nutrition Ltd,,18/02/2018,AMAZON,0,,0,0,18/02/2018 01:01
50,Data_Collection,,,(203) 441-4680,https://www.amazon.co.uk/sp?_encoding=UTF8&asin=B001GNBW0W&isAmazonFulfilled=1&isCBA=&marketplaceID=A1F83G8C2ARO7P&orderID=&seller=A3GQUXAD1FJQD6&tab=&vasStoreID=,EXCELLENCE SERVICES LTD,,19/02/2018,AMAZON,0,,0,0,19/02/2018 01:01
51,Data_Collection,,,(845) 539-0128,https://www.amazon.co.uk/sp?_encoding=UTF8&asin=&isAmazonFulfilled=&isCBA=&marketplaceID=A1F83G8C2ARO7P&orderID=&seller=A15TW43BF9Y9WW&tab=&vasStoreID=,Ex-Pro Products Limited,,20/02/2018,AMAZON,0,,0,0,20/02/2018 01:01
52,Data_Collection,,,07449 260346,https://www.amazon.co.uk/sp?_encoding=UTF8&asin=B000IWXWI2&isAmazonFulfilled=&isCBA=&marketplaceID=A1F83G8C2ARO7P&orderID=&seller=A2L5BZL0IN7DCD&tab=home&vasStoreID=,FIRST STOPS TRADING LTD,,21/02/2018,AMAZON,0,,0,0,21/02/2018 01:01
53,Data_Collection,,info@flbeuropa.com,(44207) 278-2011,https://www.amazon.co.uk/sp?_encoding=UTF8&asin=B00BLGWEME&isAmazonFulfilled=0&isCBA=&marketplaceID=A1F83G8C2ARO7P&orderID=&seller=A2ZVYT2YCLIWNU&tab=&vasStoreID=,FLB EUROPE LTD,,22/02/2018,AMAZON,0,,0,0,22/02/2018 01:01
54,Data_Collection,,,(845) 458-0830,https://www.amazon.co.uk/sp?_encoding=UTF8&asin=B005S3YGN6&isAmazonFulfilled=0&isCBA=&marketplaceID=A1F83G8C2ARO7P&orderID=&seller=A22KL4R3SR9NNI&tab=&vasStoreID=,Fountayne International Supplies Ltd,,23/02/2018,AMAZON,0,,0,0,23/02/2018 01:01
55,Data_Collection,,,(861351) 502-9223,https://www.amazon.co.uk/sp?_encoding=UTF8&asin=B01463FUJW&isAmazonFulfilled=0&isCBA=&marketplaceID=A1F83G8C2ARO7P&orderID=&seller=AXA2QK0H4UA9Y&tab=&vasStoreID=,Fuzhou Tuosuo Trade Co  Ltd,,24/02/2018,AMAZON,0,,0,0,24/02/2018 01:01
56,Data_Collection,,hairandbeauty171@icloud.com,(208) 908-4651,https://www.amazon.co.uk/sp?_encoding=UTF8&asin=B002GENWU8&isAmazonFulfilled=0&isCBA=&marketplaceID=A1F83G8C2ARO7P&orderID=&seller=A3SI2WLLP7JBFI&tab=&vasStoreID=,HAIRNBEAUTY LTD,,25/02/2018,AMAZON,0,,0,0,25/02/2018 01:01
57,Data_Collection,,,(44162) 361-9869,https://www.amazon.co.uk/sp?_encoding=UTF8&asin=B00HQE27HC&isAmazonFulfilled=1&isCBA=&marketplaceID=A1F83G8C2ARO7P&orderID=&seller=A11U55BXG8057V&tab=&vasStoreID=,Harrista Encasa Limited,,26/02/2018,AMAZON,0,,0,0,26/02/2018 01:01
58,Data_Collection,,info@promotionalhandling.co.uk,(795) 646-1241,https://www.amazon.co.uk/sp?_encoding=UTF8&asin=B006OZEYR0&isAmazonFulfilled=0&isCBA=&marketplaceID=A1F83G8C2ARO7P&orderID=&seller=A1ZVQZL2SCOA69&tab=&vasStoreID=,Head Promotions Limited,,27/02/2018,AMAZON,0,,0,0,27/02/2018 01:01
59,Data_Collection,,,(192) 382-5288,https://www.amazon.co.uk/sp?_encoding=UTF8&asin=B000KU93FS&isAmazonFulfilled=0&isCBA=&marketplaceID=A1F83G8C2ARO7P&orderID=&seller=A2BZBCP70EM9YI&tab=&vasStoreID=,Health Dispense Limited,,28/02/2018,AMAZON,0,,0,0,28/02/2018 01:01
60,Data_Collection,,joan@hearingdirect.com,(800) 032-1301,https://www.amazon.co.uk/sp?_encoding=UTF8&asin=B074PF2M9V&isAmazonFulfilled=0&isCBA=&marketplaceID=A1F83G8C2ARO7P&orderID=&seller=A2FKZY6OHHFG8S&tab=&vasStoreID=,Hearing Direct Limited,,01/03/2018,AMAZON,0,,0,0,01/03/2018 01:01
61,Data_Collection,,hijqualityonsale@hotmail.co.uk,(208) 127-1200,https://www.amazon.co.uk/sp?_encoding=UTF8&asin=B00K2UAXEQ&isAmazonFulfilled=0&isCBA=&marketplaceID=A1F83G8C2ARO7P&orderID=&seller=A18ZEH8ABBMCX5&tab=&vasStoreID=,HIJ Sales Quality LTD,,02/03/2018,AMAZON,0,,0,0,02/03/2018 01:01
62,Data_Collection,,,(208) 123-7026,https://www.amazon.co.uk/sp?_encoding=UTF8&asin=B0160Y4TYM&isAmazonFulfilled=0&isCBA=&marketplaceID=A1F83G8C2ARO7P&orderID=&seller=A2PGHEHFQLIZ8E&tab=&vasStoreID=,Homeupath Ltd,,03/03/2018,AMAZON,0,,0,0,03/03/2018 01:01
63,Data_Collection,,,(120) 438-5199,https://www.amazon.co.uk/sp?_encoding=UTF8&asin=B00HVLUR54&isAmazonFulfilled=0&isCBA=&marketplaceID=A1F83G8C2ARO7P&orderID=&seller=A3LRXD7WRPCCYQ&tab=&vasStoreID=,HW Audio Ltd,,04/03/2018,AMAZON,0,,0,0,04/03/2018 01:01
64,Data_Collection,,info@irys.co.uk,(208) 127-8690,https://www.amazon.co.uk/sp?_encoding=UTF8&asin=B00B84OJ54&isAmazonFulfilled=0&isCBA=&marketplaceID=A1F83G8C2ARO7P&orderID=&seller=AAYBTYMOOFM36&tab=&vasStoreID=,IRYS COSMETICS LTD,,05/03/2018,AMAZON,0,,0,0,05/03/2018 01:01
65,Data_Collection,,info@duncanspharmacy.co.uk,(44208) 858-1953,https://www.amazon.co.uk/sp?_encoding=UTF8&asin=B004SGO4DG&isAmazonFulfilled=0&isCBA=&marketplaceID=A1F83G8C2ARO7P&orderID=&seller=A215UU84OW3EP7&tab=&vasStoreID=,Ishrosh Healthcare Limited,,06/03/2018,AMAZON,0,,0,0,06/03/2018 01:01
66,Data_Collection,,info@yankeedirect.com,(333) 050-4452,https://www.amazon.co.uk/sp?_encoding=UTF8&asin=B0038MLN4O&isAmazonFulfilled=0&isCBA=&marketplaceID=A1F83G8C2ARO7P&orderID=&seller=A2FZ2F1FCRJRIR&tab=&vasStoreID=,J & L (NI) Limited,,07/03/2018,AMAZON,0,,0,0,07/03/2018 01:01
67,Data_Collection,,sales@jakproducts.co.uk,01522 512220,https://www.amazon.co.uk/sp?_encoding=UTF8&asin=B012WTGFHS&isAmazonFulfilled=&isCBA=&marketplaceID=A1F83G8C2ARO7P&orderID=&seller=A5VAXJLLV32LH&tab=home&vasStoreID=,JAK PRODUCTS LTD,,08/03/2018,AMAZON,0,,0,0,08/03/2018 01:01
68,Data_Collection,,edmond@myfelix.com,(207) 359-7595,https://www.amazon.co.uk/sp?_encoding=UTF8&asin=B002PK0ROM&isAmazonFulfilled=0&isCBA=&marketplaceID=A1F83G8C2ARO7P&orderID=&seller=A18QPDJAWL3GVU&tab=&vasStoreID=,Kanari Internet Ltd,,09/03/2018,AMAZON,0,,0,0,09/03/2018 01:01
69,Data_Collection,,,(845) 459-0140,https://www.amazon.co.uk/sp?_encoding=UTF8&asin=B007KJIVC8&isAmazonFulfilled=0&isCBA=&marketplaceID=A1F83G8C2ARO7P&orderID=&seller=A116EKJ8I5ZQ21&tab=&vasStoreID=,KAROWI LTD,,10/03/2018,AMAZON,0,,0,0,10/03/2018 01:01
70,Data_Collection,,,(113) 286-2795,https://www.amazon.co.uk/sp?_encoding=UTF8&asin=B0070X35E8&isAmazonFulfilled=0&isCBA=&marketplaceID=A1F83G8C2ARO7P&orderID=&seller=A3IKWZZ5MNG7NN&tab=&vasStoreID=,KELISDAR ENTERPRISES LIMITED,,11/03/2018,AMAZON,0,,0,0,11/03/2018 01:01
71,Data_Collection,,keren@personalisedmemento.co.uk,(800) 009-2110,https://www.amazon.co.uk/sp?_encoding=UTF8&asin=B005WH8EEU&isAmazonFulfilled=0&isCBA=&marketplaceID=A1F83G8C2ARO7P&orderID=&seller=A3MZRXMXZS4LHC&tab=&vasStoreID=,keren@personalisedmemento.co.uk,,12/03/2018,AMAZON,0,,0,0,12/03/2018 01:01
72,Data_Collection,,sales@kickmobiles.com,(207) 373-5004,https://www.amazon.co.uk/sp?_encoding=UTF8&asin=B01MCW7EOW&isAmazonFulfilled=0&isCBA=&marketplaceID=A1F83G8C2ARO7P&orderID=&seller=A28HZFCR4FPJ1R&tab=&vasStoreID=,KICKMOBILES LIMITED,,13/03/2018,AMAZON,0,,0,0,13/03/2018 01:01
73,Data_Collection,,,(162) 268-1765,https://www.amazon.co.uk/sp?_encoding=UTF8&asin=&isAmazonFulfilled=&isCBA=&marketplaceID=A1F83G8C2ARO7P&orderID=&seller=A2FW9XD7FFS162&tab=shipping&vasStoreID=#rates,LAGUNA MOTOR CYCLES LIMITED,,14/03/2018,AMAZON,0,,0,0,14/03/2018 01:01
74,Data_Collection,,customerservice@lifestylish.com,(170) 630-2010,https://www.amazon.co.uk/sp?_encoding=UTF8&asin=B003WOP11O&isAmazonFulfilled=0&isCBA=&marketplaceID=A1F83G8C2ARO7P&orderID=&seller=A1VHQV0OFY1R5J&tab=&vasStoreID=,LIFESTYLISH LTD,,15/03/2018,AMAZON,0,,0,0,15/03/2018 01:01
75,Data_Collection,,sales@linkwholesalers.co.uk,2089614114,https://www.amazon.co.uk/sp?_encoding=UTF8&asin=B0087O0UDI&isAmazonFulfilled=0&isCBA=&marketplaceID=A1F83G8C2ARO7P&orderID=&seller=A23HN5WU0IJQJQ&tab=&vasStoreID=,LINK WHOLESALERS LIMITED,,16/03/2018,AMAZON,0,,0,0,16/03/2018 01:01
76,Data_Collection,,info@luxeresidential.co.uk,,https://www.amazon.co.uk/sp?_encoding=UTF8&asin=B018R3WSHO&isAmazonFulfilled=1&isCBA=&marketplaceID=A1F83G8C2ARO7P&orderID=&seller=A393AGWFW030KO&tab=&vasStoreID=,LUXE ENGLAND LIMITED,,17/03/2018,AMAZON,0,,0,0,17/03/2018 01:01
77,Data_Collection,,info@acshropshire.co.uk,(44775) 802-2616,https://www.amazon.co.uk/sp?_encoding=UTF8&asin=B001E50IBQ&isAmazonFulfilled=1&isCBA=&marketplaceID=A1F83G8C2ARO7P&orderID=&seller=AAI9GY8H2UQTU&tab=&vasStoreID=,LW SHROPSHIRE LTD,,18/03/2018,AMAZON,0,,0,0,18/03/2018 01:01
78,Data_Collection,,info@robco.co.uk,(208) 908-4862,https://www.amazon.co.uk/sp?_encoding=UTF8&asin=B0017RHFQW&isAmazonFulfilled=0&isCBA=&marketplaceID=A1F83G8C2ARO7P&orderID=&seller=AXJLU7T6LT8E6&tab=&vasStoreID=,Lyndons Art & Graphics Limited,,19/03/2018,AMAZON,0,,0,0,19/03/2018 01:01
79,Data_Collection,,info@m3-tec.com,(44203) 015-5420,https://www.amazon.co.uk/sp?_encoding=UTF8&asin=B00VX6ULWM&isAmazonFulfilled=0&isCBA=&marketplaceID=A1F83G8C2ARO7P&orderID=&seller=A1Z0F1ZOPGPOE0&tab=&vasStoreID=,M3 Electronics LTD,,20/03/2018,AMAZON,0,,0,0,20/03/2018 01:01
80,Data_Collection,,,(44203) 633-2139,https://www.amazon.co.uk/sp?_encoding=UTF8&asin=B00L7X6D0K&isAmazonFulfilled=1&isCBA=&marketplaceID=A1F83G8C2ARO7P&orderID=&seller=A1SQGF71TODY2R&tab=&vasStoreID=,Marvel Supplements Ltd,,21/03/2018,AMAZON,0,,0,0,21/03/2018 01:01
81,Data_Collection,,,(44794) 944-7144,https://www.amazon.co.uk/sp?_encoding=UTF8&asin=B00BHXMO3A&isAmazonFulfilled=0&isCBA=&marketplaceID=A1F83G8C2ARO7P&orderID=&seller=A3C479CWS3N3WF&tab=&vasStoreID=,Mato Investments Ltd,,22/03/2018,AMAZON,0,,0,0,22/03/2018 01:01
82,Data_Collection,,info@mayurenterprise.com,(192) 359-0627,https://www.amazon.co.uk/sp?_encoding=UTF8&asin=B005ELBX9M&isAmazonFulfilled=0&isCBA=&marketplaceID=A1F83G8C2ARO7P&orderID=&seller=A18UWKRNPBNQUK&tab=&vasStoreID=,mayur enterprises limited,,23/03/2018,AMAZON,0,,0,0,23/03/2018 01:01
83,Data_Collection,,sales@medichest.com,(193) 327-7077,https://www.amazon.co.uk/sp?_encoding=UTF8&asin=B0018Z5R8G&isAmazonFulfilled=0&isCBA=&marketplaceID=A1F83G8C2ARO7P&orderID=&seller=ALA60GNOT0LM&tab=&vasStoreID=,Medichest Ltd,,24/03/2018,AMAZON,0,,0,0,24/03/2018 01:01
84,Data_Collection,,,(286) 772-9131,https://www.amazon.co.uk/sp?_encoding=UTF8&asin=B00555V3YW&isAmazonFulfilled=0&isCBA=&marketplaceID=A1F83G8C2ARO7P&orderID=&seller=A1TYAMTWZM94D2&tab=&vasStoreID=,Mega Deals Every Day Limited,,25/03/2018,AMAZON,0,,0,0,25/03/2018 01:01